BDBM50446962 CHEMBL3115785
SMILES CCCCCCc1cc2cc(Cl)ccc2n1C(=O)CC(C)CC(O)=O
InChI Key InChIKey=LDXKYWAZGKIBOG-UHFFFAOYSA-N
Data  1 IC50
  Tab Delimited (TSV)   2D SDfile   Computed 3D by Vconf -m prep SDfile
Find this compound or compounds like it in BindingDB:
Activity Spreadsheet -- Enzyme Inhibition Constant Data from BindingDB
Found 1 hit for monomerid = 50446962
TargetOxoeicosanoid receptor 1(Homo sapiens (Human))
Mcgill University
Curated by ChEMBL
LigandPNGBDBM50446962(CHEMBL3115785)
Affinity DataIC50:  141nM. Assay description: Antagonist activity at OXE receptor (unknown origin) expressed in indo-1 loaded neutrophils assessed as inhibition of 5-oxo-ETE-induced calcium mobil...
In DepthDetails ArticlePubMed