BDBM50450366 CHEMBL49265
SMILES COc1ccc(cc1)-c1nc(SCCCCCN(CCc2ccccn2)C(=O)NC(C)C)[nH]c1-c1ccc(OC)cc1
InChI Key InChIKey=OWWILZRRLBDHOC-UHFFFAOYSA-N
Data  2 IC50
  Tab Delimited (TSV)   2D SDfile   Computed 3D by Vconf -m prep SDfile
Find this compound or compounds like it in BindingDB:
Activity Spreadsheet -- Enzyme Inhibition Constant Data from BindingDB
Found 2 hits for monomerid = 50450366
TargetSterol O-acyltransferase 1(Rattus norvegicus)
Dupont Pharmaceuticals
Curated by ChEMBL
LigandPNGBDBM50450366(CHEMBL49265)
Affinity DataIC50:  260nM. Assay description: In vitro inhibition of Acyl coenzyme A:cholesterol acyltransferase (ACAT) in rat hepatic microsomes
In DepthDetails
TargetSterol O-acyltransferase 1(Mus musculus)
Dupont Pharmaceuticals
Curated by ChEMBL
LigandPNGBDBM50450366(CHEMBL49265)
Affinity DataIC50:  90nM. Assay description: Inhibition of Acyl coenzyme A:cholesterol acyltransferase (ACAT) in J774 Macrophage cell culture
In DepthDetails