BDBM50452323 CHEMBL4214862
SMILES Fc1ccc(Cn2ccc(NC(=O)Cc3ccc(nc3)N3CCC(F)(F)C3)n2)cc1F
InChI Key InChIKey=WRNOOHMVZMXYDO-UHFFFAOYSA-N
Data  3 IC50
  Tab Delimited (TSV)   2D SDfile   Computed 3D by Vconf -m prep SDfile
Find this compound or compounds like it in BindingDB:
Activity Spreadsheet -- Enzyme Inhibition Constant Data from BindingDB
Found 3 hits for monomerid = 50452323
TargetVoltage-dependent T-type calcium channel subunit alpha-1I(Homo sapiens (Human))
Idorsia Pharmaceuticals
Curated by ChEMBL
LigandPNGBDBM50452323(CHEMBL4214862)
Affinity DataIC50:  2.30nM. Assay description: Inhibition of recombinant Cav3.3 (unknown origin) expressed in HEK293 cells assessed as decrease in calcium flux preincubated for 3 mins followed by ...
Ligand InfoPC cidPC sid
In DepthDetails ArticlePubMed
TargetVoltage-dependent T-type calcium channel subunit alpha-1H(Homo sapiens (Human))
Idorsia Pharmaceuticals
Curated by ChEMBL
LigandPNGBDBM50452323(CHEMBL4214862)
Affinity DataIC50:  6.70nM. Assay description: Inhibition of recombinant Cav3.2 (unknown origin) expressed in HEK293 cells assessed as decrease in calcium flux preincubated for 3 mins followed by ...
Ligand InfoPC cidPC sid
In DepthDetails ArticlePubMed
TargetVoltage-dependent T-type calcium channel subunit alpha-1G(Homo sapiens (Human))
Idorsia Pharmaceuticals
Curated by ChEMBL
LigandPNGBDBM50452323(CHEMBL4214862)
Affinity DataIC50:  1.10nM. Assay description: Inhibition of recombinant Cav3.1 (unknown origin) expressed in HEK293 cells assessed as decrease in calcium flux preincubated for 3 mins followed by ...
Ligand InfoPC cidPC sid
In DepthDetails ArticlePubMed