BDBM50453230 CHEMBL4217517
SMILES N[C@H]1CC[C@@H](CC1)Nc1nc(Nc2ccc(cc2)N2CCN(Cc3ccccc3)CC2)c2ncn(C3CCCC3)c2n1
InChI Key InChIKey=HNRWDZSSLWFYRN-DUYHBEBVSA-N
Data  2 IC50
  Tab Delimited (TSV)   2D SDfile   Computed 3D by Vconf -m prep SDfile
Find this compound or compounds like it in BindingDB:
Activity Spreadsheet -- Enzyme Inhibition Constant Data from BindingDB
Found 2 hits for monomerid = 50453230
TargetPlatelet-derived growth factor receptor alpha(Homo sapiens (Human))
Palack£
Curated by ChEMBL
LigandPNGBDBM50453230(CHEMBL4217517)
Affinity DataIC50:  35nM. Assay description: Inhibition of recombinant human 3C cleavage site/N-terminal GST-His6 fused PDGFR alpha C-terminal fragment (Q551 to L1089 residues) harboring V561D m...
Ligand InfoPC cidPC sid
In DepthDetails ArticlePubMed
TargetReceptor-type tyrosine-protein kinase FLT3(Homo sapiens (Human))
Palack£
Curated by ChEMBL
LigandPNGBDBM50453230(CHEMBL4217517)
Affinity DataIC50:  6nM. Assay description: Inhibition of N-terminal GST/His6-fused recombinant human FLT3 (R571 to S993 residues) ITD mutant expressed in Sf9 insect cells using poly (Ala,Glu,L...
Ligand InfoPC cidPC sid
In DepthDetails ArticlePubMed