BDBM50453250 CHEMBL4215541
SMILES CN(C)CCNC(=O)c1cccc(c1)-c1cnc2ccc(nn12)-c1cccs1
InChI Key InChIKey=WWJQERVKTFKCOB-UHFFFAOYSA-N
Data  1 IC50
PDB links: 1 PDB ID matches this monomer.
  Tab Delimited (TSV)   2D SDfile   Computed 3D by Vconf -m prep SDfile
Find this compound or compounds like it in BindingDB:
Activity Spreadsheet -- Enzyme Inhibition Constant Data from BindingDB
Found 1 hit for monomerid = 50453250
LigandPNGBDBM50453250(CHEMBL4215541)
Affinity DataIC50:  37nM. Assay description: Inhibition of recombinant human full length His-tagged CaMK2delta expressed in baculovirus using Biotin labelled STK1 as substrate after 1 hr in pres...
Ligand InfoPC cidPC sidPDB