BDBM50453543 CHEMBL2113570
SMILES CCNC(=O)[C@H]1O[C@H]([C@H](O)[C@@H]1O)n1cnc2c(NCc3ccccc3[N+]([O-])=O)ncnc12
InChI Key InChIKey=CZZHLXAEYDPEMY-QCUYGVNKSA-N
Data  2 KI
  Tab Delimited (TSV)   2D SDfile   Computed 3D by Vconf -m prep SDfile
Find this compound or compounds like it in BindingDB:
Activity Spreadsheet -- Enzyme Inhibition Constant Data from BindingDB
Found 2 hits for monomerid = 50453543
TargetAdenosine receptor A3(Rattus norvegicus)
National Institute Of Diabetes
Curated by ChEMBL
LigandPNGBDBM50453543(CHEMBL2113570)
Affinity DataKi:  2.80nM. Assay description: Binding affinity for recombinant rat A3-adenosine receptor by the displacement of specific [125I]APNEA or [125I]-N6-(4-amino-3-iodobenzyl)-adenosine-...
In DepthDetails ArticlePubMed
TargetAdenosine receptor A1(Rattus norvegicus (rat))
National Institute Of Diabetes
Curated by ChEMBL
LigandPNGBDBM50453543(CHEMBL2113570)
Affinity DataKi:  31nM. Assay description: Binding affinity for A1-adenosine receptor by the displacement of specific [3H]-PIA binding in rat brain was determined
In DepthDetails ArticlePubMed