BDBM50453670 CHEMBL2113700
SMILES Cn1cnc2c(NCc3cccc(I)c3)nc(N)nc12
InChI Key InChIKey=CRCODYWJYJOVSH-UHFFFAOYSA-N
Data  3 KI
  Tab Delimited (TSV)   2D SDfile   Computed 3D by Vconf -m prep SDfile
Find this compound or compounds like it in BindingDB:
Activity Spreadsheet -- Enzyme Inhibition Constant Data from BindingDB
Found 3 hits for monomerid = 50453670
TargetAdenosine receptor A2a(Rattus norvegicus (rat))
National Institute Of Diabetes
Curated by ChEMBL
LigandPNGBDBM50453670(CHEMBL2113700)
Affinity DataKi:  3.22E+3nM. Assay description: Binding affinity against adenosine A2A receptor from rat brain.
In DepthDetails ArticlePubMed
TargetAdenosine receptor A1(Rattus norvegicus (rat))
National Institute Of Diabetes
Curated by ChEMBL
LigandPNGBDBM50453670(CHEMBL2113700)
Affinity DataKi:  5.57E+3nM. Assay description: Binding affinity against adenosine A1 receptor from rat brain.
In DepthDetails ArticlePubMed
TargetAdenosine receptor A3(Rattus norvegicus)
National Institute Of Diabetes
Curated by ChEMBL
LigandPNGBDBM50453670(CHEMBL2113700)
Affinity DataKi:  4.01E+4nM. Assay description: Binding affinity against adenosine A3 receptor from rat brain.
In DepthDetails ArticlePubMed