BDBM50456208 CHEMBL2112605
SMILES COc1cccc(C(=O)NC2CC3CCCC(C2)N3Cc2ccccc2)c1OC
InChI Key InChIKey=ZEPBXECUPSIRLM-UHFFFAOYSA-N
Data  1 KI
  Tab Delimited (TSV)   2D SDfile   Computed 3D by Vconf -m prep SDfile
Find this compound or compounds like it in BindingDB:
Activity Spreadsheet -- Enzyme Inhibition Constant Data from BindingDB
Found 1 hit for monomerid = 50456208
TargetD(2) dopamine receptor(Rattus norvegicus (rat))
University Of Pennsylvania
Curated by ChEMBL
LigandPNGBDBM50456208(CHEMBL2112605)
Affinity DataKi:  0.0380nM. Assay description: Inhibition of [125I]- NCQ 298 binding to D2 receptor of rat striatal tissue
In DepthDetails ArticlePubMed