BDBM50456273 CHEMBL4214428
SMILES CC1(CCN(CC1)c1c(cnc2ccsc12)C(=O)N1CCN(CC1)C(=O)C1CC1)C#N
InChI Key InChIKey=HEVYKFASCFEPAC-UHFFFAOYSA-N
Data  2 IC50
  Tab Delimited (TSV)   2D SDfile   Computed 3D by Vconf -m prep SDfile
Find this compound or compounds like it in BindingDB:
Activity Spreadsheet -- Enzyme Inhibition Constant Data from BindingDB
Found 2 hits for monomerid = 50456273
TargetAldehyde dehydrogenase 1A1(Homo sapiens (Human))
National Center For Advancing Translational Sciences
Curated by ChEMBL
LigandPNGBDBM50456273(CHEMBL4214428)
Affinity DataIC50:  17nM. Assay description: Inhibition of human ALDH1A1 using NAD+/propionaldehyde as substrate/cofactor preincubated for 15 mins followed by substrate/cofactor addition measure...
Ligand InfoPC cidPC sid
In DepthDetails ArticlePubMed
TargetAldehyde dehydrogenase 1A1(Homo sapiens (Human))
National Center For Advancing Translational Sciences
Curated by ChEMBL
LigandPNGBDBM50456273(CHEMBL4214428)
Affinity DataIC50:  1.05E+3nM. Assay description: Inhibition of ALDH1A1 in human MIAPaCa2 cells after 30 mins by aldefluor assay
Ligand InfoPC cidPC sid
In DepthDetails ArticlePubMed