BDBM50457567 CHEMBL3891815
SMILES CCN(CC)c1ccc(cc1CC)-c1cc(ccc1OCCCO)-c1ccc(cc1)C(O)=O
InChI Key InChIKey=BQUVDAXXESUSBC-UHFFFAOYSA-N
Data  3 EC50
  Tab Delimited (TSV)   2D SDfile   Computed 3D by Vconf -m prep SDfile
Find this compound or compounds like it in BindingDB:
Activity Spreadsheet -- Enzyme Inhibition Constant Data from BindingDB
Found 3 hits for monomerid = 50457567
TargetRetinoic acid receptor beta(Homo sapiens (Human))
Nestle Skin Health
Curated by ChEMBL
LigandPNGBDBM50457567(CHEMBL3891815)
Affinity DataEC50:  35nM. Assay description: Agonist activity at GAL4 DNA-binding domain-tagged RARbeta (unknown origin) ligand-binding domain expressed in human HG5LN cells incubated for 18 hrs...
Ligand InfoPC cidPC sid
In DepthDetails ArticlePubMed
TargetRetinoic acid receptor alpha(Homo sapiens (Human))
Nestle Skin Health
Curated by ChEMBL
LigandPNGBDBM50457567(CHEMBL3891815)
Affinity DataEC50:  270nM. Assay description: Agonist activity at GAL4 DNA-binding domain-tagged RARalpha (unknown origin) ligand-binding domain expressed in human HG5LN cells incubated for 18 hr...
Ligand InfoPC cidPC sid
In DepthDetails ArticlePubMed
TargetRetinoic acid receptor gamma(Homo sapiens (Human))
Nestle Skin Health
Curated by ChEMBL
LigandPNGBDBM50457567(CHEMBL3891815)
Affinity DataEC50:  20nM. Assay description: Agonist activity at GAL4 DNA-binding domain-tagged RARgamma (unknown origin) ligand-binding domain expressed in human HG5LN cells incubated for 18 hr...
Ligand InfoPC cidPC sid
In DepthDetails ArticlePubMed