BDBM50457626 CHEMBL4215398
SMILES [H][C@]1(C[C@@H]2Cc3cc(O)cc(O)c3C(=O)O2)CCC[C@@H](C)O1
InChI Key InChIKey=WOMKDMUZNBFXKG-WQAKAFBOSA-N
Data  2 IC50
PDB links: 1 PDB ID matches this monomer.
  Tab Delimited (TSV)   2D SDfile   Computed 3D by Vconf -m prep SDfile
Find this compound or compounds like it in BindingDB:
Activity Spreadsheet -- Enzyme Inhibition Constant Data from BindingDB
Found 2 hits for monomerid = 50457626
TargetLysine--tRNA ligase(Plasmodium falciparum (isolate 3D7))
Csir-National Chemical Laboratory
Curated by ChEMBL
LigandPNGBDBM50457626(CHEMBL4215398)
Affinity DataIC50:  2.13E+4nM. Assay description: Inhibition of Plasmodium falciparum KRS expressed in Escherichia coli BL21 using tRNA(Lys) as substrate after 45 mins in presence of L-lysine by AMP-...
Ligand InfoPC cidPC sidPDB
TargetLysine--tRNA ligase(Homo sapiens (Human))
Csir-National Chemical Laboratory
Curated by ChEMBL
LigandPNGBDBM50457626(CHEMBL4215398)
Affinity DataIC50: >1.00E+5nM. Assay description: Inhibition of human KRS expressed in Escherichia coli BL21 using tRNA(Lys) as substrate after 1 hr in presence of L-lysine by AMP-GLO assay
Ligand InfoPC cidPC sidPDB
In DepthDetails ArticlePubMed