BDBM50460686 CHEMBL4228799
SMILES CCOC(=O)c1c(N2CCN(CC2)c2ccc(F)cc2)c2ccccc2n(CC)c1=O
InChI Key InChIKey=IFUFOSPBDDUKBY-UHFFFAOYSA-N
Data  1 KI
  Tab Delimited (TSV)   2D SDfile   Computed 3D by Vconf -m prep SDfile
Find this compound or compounds like it in BindingDB:
Activity Spreadsheet -- Enzyme Inhibition Constant Data from BindingDB
Found 1 hit for monomerid = 50460686
Target4,4'-diapophytoene synthase(Staphylococcus aureus)
Csir-Institute Of Chemical Technology
Curated by ChEMBL
LigandPNGBDBM50460686(CHEMBL4228799)
Affinity DataKi:  6.89E+3nM. Assay description: Inhibition of Staphylococcus aureus dehydrosqualene synthase
Ligand InfoPC cidPC sid
In DepthDetails ArticlePubMed