BDBM50460949 CHEMBL4227817
SMILES CC(C)Nc1ccc2cnn(-c3cncc(n3)-c3ccc(cc3F)C(O)=O)c2c1
InChI Key InChIKey=PLGUCBXOJHSJEN-UHFFFAOYSA-N
Data  6 IC50
  Tab Delimited (TSV)   2D SDfile   Computed 3D by Vconf -m prep SDfile
Find this compound or compounds like it in BindingDB:
Activity Spreadsheet -- Enzyme Inhibition Constant Data from BindingDB
Found 6 hits for monomerid = 50460949
TargetCasein kinase II subunit alpha(Homo sapiens (Human))
Astrazeneca
Curated by ChEMBL
LigandPNGBDBM50460949(CHEMBL4227817)
Affinity DataIC50:  5nM. Assay description: Inhibition of recombinant human full length N-terminal His6-tagged CK2alpha expressed in Sf21 insect cells using CK2tide as substrate treated for 20 ...
Ligand InfoPC cidPC sid
In DepthDetails ArticlePubMed
TargetSerine/threonine-protein kinase pim-2(Homo sapiens (Human))
Astrazeneca
Curated by ChEMBL
LigandPNGBDBM50460949(CHEMBL4227817)
Affinity DataIC50:  8.60E+3nM. Assay description: Inhibition of human PIM2
Ligand InfoPC cidPC sid
In DepthDetails ArticlePubMed
TargetSerine/threonine-protein kinase pim-1(Homo sapiens (Human))
Astrazeneca
Curated by ChEMBL
LigandPNGBDBM50460949(CHEMBL4227817)
Affinity DataIC50:  5.40E+3nM. Assay description: Inhibition of PIM1 (unknown origin) expressed in human U2OS cells assessed as reduction in BAD substrate phosphorylation by ELISA
Ligand InfoPC cidPC sid
In DepthDetails ArticlePubMed
TargetSerine/threonine-protein kinase pim-2(Homo sapiens (Human))
Astrazeneca
Curated by ChEMBL
LigandPNGBDBM50460949(CHEMBL4227817)
Affinity DataIC50:  2.20E+4nM. Assay description: Inhibition of PIM2 (unknown origin) expressed in human U2OS cells assessed as reduction in BAD substrate phosphorylation by ELISA
Ligand InfoPC cidPC sid
In DepthDetails ArticlePubMed
TargetSerine/threonine-protein kinase pim-1(Homo sapiens (Human))
Astrazeneca
Curated by ChEMBL
LigandPNGBDBM50460949(CHEMBL4227817)
Affinity DataIC50:  200nM. Assay description: Inhibition of human PIM1
Ligand InfoPC cidPC sid
In DepthDetails ArticlePubMed
TargetCasein kinase II subunit alpha(Homo sapiens (Human))
Astrazeneca
Curated by ChEMBL
LigandPNGBDBM50460949(CHEMBL4227817)
Affinity DataIC50:  340nM. Assay description: Inhibition of CK2alpha in human HCT116 or human DLD1 cells assessed as decrease in AKT phosphorylation at S129 residue after 3 to 24 hrs by Western b...
Ligand InfoPC cidPC sid
In DepthDetails ArticlePubMed