BDBM50461992 CHEMBL4117551
SMILES CC(C)Oc1ccc(CN)cc1Cl
InChI Key InChIKey=IMVIKRQERQOQKJ-UHFFFAOYSA-N
Data  1 IC50
PDB links: 1 PDB ID matches this monomer.
  Tab Delimited (TSV)   2D SDfile   Computed 3D by Vconf -m prep SDfile
Find this compound or compounds like it in BindingDB:
Activity Spreadsheet -- Enzyme Inhibition Constant Data from BindingDB
Found 1 hit for monomerid = 50461992
TargetCasein kinase II subunit alpha/beta(Homo sapiens (Human))
University Of Cambridge
Curated by ChEMBL
LigandPNGBDBM50461992(CHEMBL4117551)
Affinity DataIC50:  3.00E+6nM. Assay description: Inhibition of CK2alpha (unknown origin) (2 to 329 residues) expressed in Escherichia coli BL21 (DE3) interaction with CK2beta (unknown origin) using ...