BDBM50462083 CHEMBL4237531
SMILES OP(O)(=O)OC[C@H](NC(=O)CNC(=O)c1ccc(CCl)cc1)C(=O)NCc1ccc2OCOc2c1
InChI Key InChIKey=LRDBMUOWCPZQDD-INIZCTEOSA-N
Data  1 IC50
  Tab Delimited (TSV)   2D SDfile   Computed 3D by Vconf -m prep SDfile
Find this compound or compounds like it in BindingDB:
Activity Spreadsheet -- Enzyme Inhibition Constant Data from BindingDB
Found 1 hit for monomerid = 50462083
Target14-3-3 protein sigma(Homo sapiens (Human))
Eindhoven University Of Technology
Curated by ChEMBL
LigandPNGBDBM50462083(CHEMBL4237531)
Affinity DataIC50:  2.60E+3nM. Assay description: Inhibition of TMR-GG-RLSHpSSLPG-NH2 binding to recombinant human GST-tagged 14-3-3-sigma preincubated for 30 mins followed by TMR-GG-RLSHpSSLPG-NH2 a...
Ligand InfoKEGGPC cidPC sid
In DepthDetails ArticlePubMed