BDBM50463322 CHEMBL4242544
SMILES Cl.NC(Cc1cccc(c1)C(=O)NCCc1ccc(O)c(O)c1)C(O)=O
InChI Key InChIKey=OILCJGMXMXWNHG-UHFFFAOYSA-N
Data  1 IC50
  Tab Delimited (TSV)   2D SDfile   Computed 3D by Vconf -m prep SDfile
Find this compound or compounds like it in BindingDB:
Activity Spreadsheet -- Enzyme Inhibition Constant Data from BindingDB
Found 1 hit for monomerid = 50463322
TargetLarge neutral amino acids transporter small subunit 1(Homo sapiens (Human))
University Of Florida
Curated by ChEMBL
LigandPNGBDBM50463322(CHEMBL4242544)
Affinity DataIC50:  3.24E+4nM. Assay description: Inhibition of LAT1-mediated [14C]-L-leucine uptake in human MCF7 cells after 5 mins by liquid scintillation counting method
Ligand InfoPC cidPC sid
In DepthDetails ArticlePubMed