BDBM50464433 CHEMBL4286367
SMILES Cc1ccc(CN2CCN(CC2)S(=O)(=O)c2cccc(c2)[N+]([O-])=O)cc1
InChI Key InChIKey=VGMUALBPUOKLMR-UHFFFAOYSA-N
Data  1 IC50
  Tab Delimited (TSV)   2D SDfile   Computed 3D by Vconf -m prep SDfile
Find this compound or compounds like it in BindingDB:
Activity Spreadsheet -- Enzyme Inhibition Constant Data from BindingDB
Found 1 hit for monomerid = 50464433
TargetPancreatic alpha-amylase(Sus scrofa (Pig))
University Of Dammam
Curated by ChEMBL
LigandPNGBDBM50464433(CHEMBL4286367)
Affinity DataIC50:  2.75E+3nM. Assay description: Inhibition of porcine pancreatic alpha-amylase using starch as substrate preincubated for 10 mins followed by substrate addition measured after 10 mi...
In DepthDetails ArticlePubMed