BDBM50465300 CHEMBL4288985
SMILES COc1ccc(Br)cc1S(=O)(=O)Nc1ccc2NC(=O)C(C)(C)Oc2c1
InChI Key InChIKey=DZFJGVOWLQYSOW-UHFFFAOYSA-N
Data  1 IC50
PDB links: 1 PDB ID matches this monomer.
  Tab Delimited (TSV)   2D SDfile   Computed 3D by Vconf -m prep SDfile
Find this compound or compounds like it in BindingDB:
Activity Spreadsheet -- Enzyme Inhibition Constant Data from BindingDB
Found 1 hit for monomerid = 50465300
TargetBromodomain-containing protein 4(Homo sapiens (Human))
Guangzhou Medical University
Curated by ChEMBL
LigandPNGBDBM50465300(CHEMBL4288985)
Affinity DataIC50:  1.99E+3nM. Assay description: Inhibition of human His6-tagged BRD4 BD1 (N44 to E168 residues) expressed in Escherichia coli BL21 (DE3) cells using H-SGRGK(Ac)GGK(Ac)GLGK(Ac)GGAK(A...
Ligand InfoPC cidPC sidPDB