BDBM50465681 CHEMBL4277299
SMILES CC(CC(O)=O)CC(=O)n1c(CCCCCCc2ccccc2)cc2ccc(Cl)cc12
InChI Key InChIKey=QHXUTOOIUDZHLW-UHFFFAOYSA-N
Data  1 IC50
  Tab Delimited (TSV)   2D SDfile   Computed 3D by Vconf -m prep SDfile
Find this compound or compounds like it in BindingDB:
Activity Spreadsheet -- Enzyme Inhibition Constant Data from BindingDB
Found 1 hit for monomerid = 50465681
TargetOxoeicosanoid receptor 1(Homo sapiens (Human))
Florida Institute Of Technology
Curated by ChEMBL
LigandPNGBDBM50465681(CHEMBL4277299)
Affinity DataIC50:  12nM. Assay description: Antagonist activity at OXE receptor in human neutrophils assessed as inhibition of 5-oxo-ETE-induced calcium mobilization incubated for 2 mins follow...
Ligand InfoPC cidPC sid
In DepthDetails ArticlePubMed