BDBM50465696 CHEMBL4281471
SMILES CS(=O)(=O)c1ncc(cn1)-n1cnnn1
InChI Key InChIKey=LUNFCNVZZDFKGY-UHFFFAOYSA-N
Data  1 IC50
  Tab Delimited (TSV)   2D SDfile   Computed 3D by Vconf -m prep SDfile
Find this compound or compounds like it in BindingDB:
Activity Spreadsheet -- Enzyme Inhibition Constant Data from BindingDB
Found 1 hit for monomerid = 50465696
Target3-oxoacyl-ACP synthase(Pseudomonas aeruginosa)
University Of Nottingham
Curated by ChEMBL
LigandPNGBDBM50465696(CHEMBL4281471)
Affinity DataIC50:  2.10E+4nM. Assay description: Inhibition of Pseudomonas aeruginosa PqsD
Ligand InfoPC cidPC sid
In DepthDetails ArticlePubMed