BDBM50466734 CHEMBL4278318
SMILES COc1cc(cc(c1O)[N+]([O-])=O)C1c2c(CCCC(C)C)n[nH]c2OC(N)=C1C#N
InChI Key InChIKey=VIDJIRHJKZRDFC-UHFFFAOYSA-N
Data  2 IC50
  Tab Delimited (TSV)   2D SDfile   Computed 3D by Vconf -m prep SDfile
Find this compound or compounds like it in BindingDB:
Activity Spreadsheet -- Enzyme Inhibition Constant Data from BindingDB
Found 2 hits for monomerid = 50466734
TargetAldo-keto reductase family 1 member C3(Homo sapiens (Human))
Guangzhou Medical University
Curated by ChEMBL
LigandPNGBDBM50466734(CHEMBL4278318)
Affinity DataIC50:  730nM. Assay description: Inhibition of recombinant human AKR1C3 expressed in Escherichia coli BL21 cells in presence of 9,10-phenanthrenequinone and NADPH by fluorescence ass...
Ligand InfoPC cidPC sid
In DepthDetails ArticlePubMed
TargetAldo-keto reductase family 1 member C1(Homo sapiens (Human))
Guangzhou Medical University
Curated by ChEMBL
LigandPNGBDBM50466734(CHEMBL4278318)
Affinity DataIC50:  1.21E+3nM. Assay description: Inhibition of recombinant human AKR1C1 expressed in Escherichia coli BL21 cells in presence of 9,10-phenanthrenequinone and NADPH by fluorescence ass...
Ligand InfoPC cidPC sid
In DepthDetails ArticlePubMed