BDBM50470748 CHEMBL36724::TCMDC-131880
SMILES COc1ccc(cc1OC1CCCC1)C1CCN(C1)C#N
InChI Key InChIKey=SQENNXPQOSFSHC-UHFFFAOYSA-N
Data  1 KI
  Tab Delimited (TSV)   2D SDfile   Computed 3D by Vconf -m prep SDfile
Find this compound or compounds like it in BindingDB:
Activity Spreadsheet -- Enzyme Inhibition Constant Data from BindingDB
Found 1 hit for monomerid = 50470748
TargetcAMP-specific 3',5'-cyclic phosphodiesterase 4B(Homo sapiens (Human))
Glaxo Research Institute
Curated by ChEMBL
LigandPNGBDBM50470748(CHEMBL36724 | TCMDC-131880)
Affinity DataKi:  89nM. Assay description: Inhibition of cAMP hydrolysis by the human phosphodiesterase 4B enzyme
Ligand InfoPC cidPC sid
In DepthDetails ArticlePubMed