BDBM50471719 CHEMBL100688
SMILES CC(C)(C)c1ccc(NC(=O)c2cc(Cl)cc(Cl)c2O)cc1
InChI Key InChIKey=OVRUMJBIPFJMIO-UHFFFAOYSA-N
Data  1 IC50
  Tab Delimited (TSV)   2D SDfile   Computed 3D by Vconf -m prep SDfile
Find this compound or compounds like it in BindingDB:
Activity Spreadsheet -- Enzyme Inhibition Constant Data from BindingDB
Found 1 hit for monomerid = 50471719
TargetSporulation kinase A(Bacillus subtilis (strain 168))
The R. W. Johnson Pharmaceutical Research Institute
Curated by ChEMBL
LigandPNGBDBM50471719(CHEMBL100688)
Affinity DataIC50:  6.70E+4nM. Assay description: Inhibition of autophosphorylation of the two-component signal transduction system kinase was measured using the KinA/Spo0F regulatory system of Bacil...
Ligand InfoPC cidPC sid
In DepthDetails ArticlePubMed