BDBM50471724 CHEMBL98743
SMILES COc1cc(OC)c(O)c(c1)C(=O)Nc1cc(Cl)c(cc1C)C(C#N)c1ccc(Cl)cc1
InChI Key InChIKey=MIVHVQRQCMQQLI-UHFFFAOYSA-N
Data  1 IC50
  Tab Delimited (TSV)   2D SDfile   Computed 3D by Vconf -m prep SDfile
Find this compound or compounds like it in BindingDB:
Activity Spreadsheet -- Enzyme Inhibition Constant Data from BindingDB
Found 1 hit for monomerid = 50471724
TargetSporulation kinase A(Bacillus subtilis (strain 168))
The R. W. Johnson Pharmaceutical Research Institute
Curated by ChEMBL
LigandPNGBDBM50471724(CHEMBL98743)
Affinity DataIC50:  2.50E+5nM. Assay description: Inhibition of autophosphorylation of the two-component signal transduction system kinase was measured using the KinA/Spo0F regulatory system of Bacil...
Ligand InfoPC cidPC sid
In DepthDetails ArticlePubMed