BDBM50472567 CHEMBL288992
SMILES CCNc1cccc(CNCC2(F)CCN(CC2)C(=O)c2ccc(F)c(Cl)c2)n1
InChI Key InChIKey=DGXPRFFOVPWQOE-UHFFFAOYSA-N
Data  1 KI  1 EC50
  Tab Delimited (TSV)   2D SDfile   Computed 3D by Vconf -m prep SDfile
Find this compound or compounds like it in BindingDB:
Activity Spreadsheet -- Enzyme Inhibition Constant Data from BindingDB
Found 2 hits for monomerid = 50472567
Target5-hydroxytryptamine receptor 1A(Rattus norvegicus (rat))
Pierre Fabre Research Center
Curated by ChEMBL
LigandPNGBDBM50472567(CHEMBL288992)
Affinity DataKi:  0.186nM. Assay description: Binding affinity towards 5-hydroxytryptamine 1A receptor in rat cortex using [3H]8-OH-DPAT as a radioligand
Ligand InfoPC cidPC sid
In DepthDetails ArticlePubMed
Target5-hydroxytryptamine receptor 1A(Homo sapiens (Human))
Pierre Fabre Research Center
Curated by ChEMBL
LigandPNGBDBM50472567(CHEMBL288992)
Affinity DataEC50:  13nM. Assay description: In vitro effective concentration required to inhibit forskolin-stimulated cAMP levels in HA7 cells expressing human 5-HT1A receptor
Ligand InfoPC cidPC sid
In DepthDetails ArticlePubMed