BDBM50474395 CHEMBL2368626
SMILES Cl.CS(=O)(=O)c1ccc2CCN(CC[C@H]3CC[C@@H](CC3)NC(=O)\C=C\c3ccccc3F)CCc2c1
InChI Key InChIKey=KWOIRJGGAJVMCA-SPQIOHDBSA-N
Data  2 KI
  Tab Delimited (TSV)   2D SDfile   Computed 3D by Vconf -m prep SDfile
Find this compound or compounds like it in BindingDB:
Activity Spreadsheet -- Enzyme Inhibition Constant Data from BindingDB
Found 2 hits for monomerid = 50474395
TargetD(3) dopamine receptor(Homo sapiens (Human))
Glaxosmithkline Pharmaceuticals
Curated by ChEMBL
LigandPNGBDBM50474395(CHEMBL2368626)
Affinity DataKi:  1.30nM. Assay description: Binding affinity against human Dopamine receptor D3 expressed in CHO cells by using [125I]iodosulpiride as radioligand
Ligand InfoPC cidPC sid
In DepthDetails ArticlePubMed
TargetD(2) dopamine receptor(Homo sapiens (Human))
Glaxosmithkline Pharmaceuticals
Curated by ChEMBL
LigandPNGBDBM50474395(CHEMBL2368626)
Affinity DataKi:  126nM. Assay description: Binding affinity against human Dopamine receptor D2 expressed in CHO cells by using [125I]iodosulpiride as radioligand
Ligand InfoPC cidPC sid
In DepthDetails ArticlePubMed