BDBM50474403 CHEMBL2368633
SMILES Cl.COc1ccccc1\C=C\C(=O)N[C@H]1CC[C@H](CCN2CCc3ccc(OS(C)(=O)=O)cc3CC2)CC1
InChI Key InChIKey=HPDNVZKGADAYFK-WDILRFRFSA-N
Data  2 KI
  Tab Delimited (TSV)   2D SDfile   Computed 3D by Vconf -m prep SDfile
Find this compound or compounds like it in BindingDB:
Activity Spreadsheet -- Enzyme Inhibition Constant Data from BindingDB
Found 2 hits for monomerid = 50474403
TargetD(3) dopamine receptor(Homo sapiens (Human))
Glaxosmithkline Pharmaceuticals
Curated by ChEMBL
LigandPNGBDBM50474403(CHEMBL2368633)
Affinity DataKi:  1.30nM. Assay description: Binding affinity against human Dopamine receptor D3 expressed in CHO cells by using [125I]iodosulpiride as radioligand
Ligand InfoPC cidPC sid
In DepthDetails ArticlePubMed
TargetD(2) dopamine receptor(Homo sapiens (Human))
Glaxosmithkline Pharmaceuticals
Curated by ChEMBL
LigandPNGBDBM50474403(CHEMBL2368633)
Affinity DataKi:  100nM. Assay description: Binding affinity against human Dopamine receptor D2 expressed in CHO cells by using [125I]iodosulpiride as radioligand
Ligand InfoPC cidPC sid
In DepthDetails ArticlePubMed