BDBM50474976 CHEMBL180557
SMILES O=C1COc2ccc(CC3CCN(CCOc4cccc5ncccc45)CC3)cc2N1
InChI Key InChIKey=JESLIPCZKNHJMZ-UHFFFAOYSA-N
Data  2 KI
  Tab Delimited (TSV)   2D SDfile   Computed 3D by Vconf -m prep SDfile
Find this compound or compounds like it in BindingDB:
Activity Spreadsheet -- Enzyme Inhibition Constant Data from BindingDB
Found 2 hits for monomerid = 50474976
Target5-hydroxytryptamine receptor 1A(Homo sapiens (Human))
Glaxosmithkline
Curated by ChEMBL
LigandPNGBDBM50474976(CHEMBL180557)
Affinity DataKi:  1.30nM. Assay description: Mean negative logarithim of binding affinity was measured for the human 5-hydroxytryptamine 1A receptor; n>/=3
Ligand InfoPC cidPC sid
In DepthDetails ArticlePubMed
TargetSodium-dependent serotonin transporter(Rattus norvegicus (rat))
Glaxosmithkline
Curated by ChEMBL
LigandPNGBDBM50474976(CHEMBL180557)
Affinity DataKi:  6.30nM. Assay description: Mean negative logarithim of binding affinity was measured for the rat serotonin transporter; n>/=3
Ligand InfoPC cidPC sid
In DepthDetails ArticlePubMed