BDBM50475477 CHEMBL372929
SMILES Cc1cc2c(cccc2n1S(=O)(=O)c1cccc(Cl)c1)N1CCNCC1
InChI Key InChIKey=RELSVNUYHIHVHB-UHFFFAOYSA-N
Data  1 KI
  Tab Delimited (TSV)   2D SDfile   Computed 3D by Vconf -m prep SDfile
Find this compound or compounds like it in BindingDB:
Activity Spreadsheet -- Enzyme Inhibition Constant Data from BindingDB
Found 1 hit for monomerid = 50475477
Target5-hydroxytryptamine receptor 6(Homo sapiens (Human))
Glaxosmithkline
Curated by ChEMBL
LigandPNGBDBM50475477(CHEMBL372929)
Affinity DataKi:  0.398nM. Assay description: Displacement of [3H]LSD from human 5-hydroxytryptamine 6 receptor expressed in HeLa cells
Ligand InfoPC cidPC sid
In DepthDetails ArticlePubMed