BDBM50477831 CHEMBL253591
SMILES C[C@H]1CNCCc2cc(Cl)c(Cl)cc12
InChI Key InChIKey=KTCVEIAEKPSBCJ-ZETCQYMHSA-N
Data  3 EC50
  Tab Delimited (TSV)   2D SDfile   Computed 3D by Vconf -m prep SDfile
Find this compound or compounds like it in BindingDB:
Activity Spreadsheet -- Enzyme Inhibition Constant Data from BindingDB
Found 3 hits for monomerid = 50477831
Target5-hydroxytryptamine receptor 2B(Homo sapiens (Human))
Arena Pharmaceuticals
Curated by ChEMBL
LigandPNGBDBM50477831(CHEMBL253591)
Affinity DataEC50:  40nM. Assay description: Agonist activity at human 5HT2B receptor expressed in HEK293 cells assessed as intracellular IP3 accumulation
Ligand InfoPC cidPC sid
In DepthDetails ArticlePubMed
Target5-hydroxytryptamine receptor 2A(Homo sapiens (Human))
Arena Pharmaceuticals
Curated by ChEMBL
LigandPNGBDBM50477831(CHEMBL253591)
Affinity DataEC50:  10nM. Assay description: Agonist activity at human 5HT2A receptor expressed in HEK293 cells assessed as intracellular IP3 accumulation
Ligand InfoPC cidPC sid
In DepthDetails ArticlePubMed
Target5-hydroxytryptamine receptor 2C(Homo sapiens (Human))
Arena Pharmaceuticals
Curated by ChEMBL
LigandPNGBDBM50477831(CHEMBL253591)
Affinity DataEC50:  4nM. Assay description: Agonist activity at human 5HT2C receptor expressed in HEK293 cells assessed as intracellular IP3 accumulation
Ligand InfoPC cidPC sid
In DepthDetails ArticlePubMed