BDBM50479096 CHEMBL498713
SMILES OC(=O)C(\O)=C\C(=O)c1cn(Cc2ccc(F)cc2)c2cc(Cl)c(Cl)cc2c1=O
InChI Key InChIKey=OZYHJYRSCKCZKX-WSVATBPTSA-N
Data  5 IC50
  Tab Delimited (TSV)   2D SDfile   Computed 3D by Vconf -m prep SDfile
Find this compound or compounds like it in BindingDB:
Activity Spreadsheet -- Enzyme Inhibition Constant Data from BindingDB
Found 5 hits for monomerid = 50479096
TargetIntegrase(Human immunodeficiency virus 1)
"Sapienza" Universit£
Curated by ChEMBL
LigandPNGBDBM50479096(CHEMBL498713)
Affinity DataIC50:  33nM. Assay description: Inhibition of HIV-1 integrase assessed as inhibition of strand transfer activity using 32P-labeled DNA as substrate after 1 hr by gel-based assay in ...
Ligand InfoPC cidPC sid
In DepthDetails ArticlePubMed
TargetIntegrase(Human immunodeficiency virus 1)
"Sapienza" Universit£
Curated by ChEMBL
LigandPNGBDBM50479096(CHEMBL498713)
Affinity DataIC50: >5.00E+4nM. Assay description: Inhibition of HIV-1 integrase assessed as inhibition of 3'-processing activity using 32P-labeled DNA as substrate after 1 hr by gel-based assay in pr...
Ligand InfoPC cidPC sid
In DepthDetails ArticlePubMed
TargetIntegrase(Human immunodeficiency virus 1)
"Sapienza" Universit£
Curated by ChEMBL
LigandPNGBDBM50479096(CHEMBL498713)
Affinity DataIC50:  1.10E+4nM. Assay description: Inhibition of recombinant HIV1 integrase 3'-end processing activity by gel-based assay in presence of magnesium
Ligand InfoPC cidPC sid
In DepthDetails ArticlePubMed
TargetIntegrase(Human immunodeficiency virus 1)
"Sapienza" Universit£
Curated by ChEMBL
LigandPNGBDBM50479096(CHEMBL498713)
Affinity DataIC50:  75nM. Assay description: Inhibition of recombinant HIV1 integrase strand transfer activity by gel-based assay in presence of magnesium
Ligand InfoPC cidPC sid
In DepthDetails ArticlePubMed
TargetIntegrase(Human immunodeficiency virus 1)
"Sapienza" Universit£
Curated by ChEMBL
LigandPNGBDBM50479096(CHEMBL498713)
Affinity DataIC50:  33nM. Assay description: Inhibition of recombinant HIV1 integrase strand transfer activity by high throughput electrochemiluminescent assay in presence of magnesium
Ligand InfoPC cidPC sid
In DepthDetails ArticlePubMed