BDBM50479870 CHEMBL494959
SMILES Cn1ncc2CC34CC5CC(OC5(C)C3)C4[C@](C)(CCC(=O)Nc3c(O)ccc(C(O)=O)c3O)c12
InChI Key InChIKey=YQFJLFIRBMHTJS-IVXMBLRSSA-N
Data  1 IC50
  Tab Delimited (TSV)   2D SDfile   Computed 3D by Vconf -m prep SDfile
Find this compound or compounds like it in BindingDB:
Activity Spreadsheet -- Enzyme Inhibition Constant Data from BindingDB
Found 1 hit for monomerid = 50479870
Target3-oxoacyl-[acyl-carrier-protein] synthase 2(Staphylococcus aureus)
Merck Research Laboratories
Curated by ChEMBL
LigandPNGBDBM50479870(CHEMBL494959)
Affinity DataIC50:  1.55E+5nM. Assay description: Inhibition of FabF-mediated type 2 fatty acid synthesis in Staphylococcus aureus by cell free assay
Ligand InfoPC cidPC sid
In DepthDetails ArticlePubMed