BDBM50480131 CHEMBL478119
SMILES CCN1\C(Sc2ccccc12)=C/C=C/C1=C/C(/CC(C)C1)=C/c1sc2ccccc2[n+]1CC
InChI Key InChIKey=ITFYGTSQODOIQX-UHFFFAOYSA-N
Data  1 IC50
  Tab Delimited (TSV)   2D SDfile   Computed 3D by Vconf -m prep SDfile
Find this compound or compounds like it in BindingDB:
Activity Spreadsheet -- Enzyme Inhibition Constant Data from BindingDB
Found 1 hit for monomerid = 50480131
TargetReplicase polyprotein 1ab(Human SARS coronavirus (SARS-CoV) (Severe acute re...)
National Health Research Institute
Curated by ChEMBL
LigandPNGBDBM50480131(CHEMBL478119)
Affinity DataIC50:  2.00E+3nM. Assay description: Inhibition of SARS Coronavirus 3C-like protease expressed in Escherichia coli
Ligand InfoPC cidPC sid
In DepthDetails ArticlePubMed