BDBM50485340 CHEMBL2046607
SMILES CC1(C)Nc2nc(N)[nH]c(=O)c2N=C1C(=O)NCC(=O)NCCS(=O)(=O)C[C@H]1O[C@H]([C@H](O)[C@@H]1O)n1cnc2c(N)ncnc12
InChI Key InChIKey=QCWCABDSXQYDST-GWKRVTOESA-N
Data  1 IC50  1 Kd
PDB links: 2 PDB IDs match this monomer.
  Tab Delimited (TSV)   2D SDfile   Computed 3D by Vconf -m prep SDfile
Find this compound or compounds like it in BindingDB:
Activity Spreadsheet -- Enzyme Inhibition Constant Data from BindingDB
Found 2 hits for monomerid = 50485340
Target2-amino-4-hydroxy-6-hydroxymethyldihydropteridine pyrophosphokinase(Escherichia coli (strain K12))
National Cancer Institute
Curated by ChEMBL
LigandPNGBDBM50485340(CHEMBL2046607)
Affinity DataKd:  4.16E+3nM. Assay description: Binding affinity to Escherichia coli HPPK at pH 8.3 by fluorometric titration
Ligand InfoPC cidPC sidPDB
Target2-amino-4-hydroxy-6-hydroxymethyldihydropteridine pyrophosphokinase(Escherichia coli (strain K12))
National Cancer Institute
Curated by ChEMBL
LigandPNGBDBM50485340(CHEMBL2046607)
Affinity DataIC50:  9.53E+3nM. Assay description: Inhibition of Escherichia coli HPPK using [alpha-33P]ATP after 30 mins
Ligand InfoPC cidPC sidPDB