BDBM50485588 CHEMBL2075023
SMILES CC(C)N(Cc1cnc2nc(N)nc(N)c2n1)c1ccc(cc1)C(=O)NC(CCCNC(=O)c1ccccc1)C(O)=O
InChI Key InChIKey=RKUARKPWZHCNMB-UHFFFAOYSA-N
Data  1 KI
  Tab Delimited (TSV)   2D SDfile   Computed 3D by Vconf -m prep SDfile
Find this compound or compounds like it in BindingDB:
Activity Spreadsheet -- Enzyme Inhibition Constant Data from BindingDB
Found 1 hit for monomerid = 50485588
TargetATP-binding cassette sub-family C member 2(Rattus norvegicus)
University Of Tokyo
Curated by ChEMBL
LigandPNGBDBM50485588(CHEMBL2075023)
Affinity DataKi:  1.48E+4nM. Assay description: TP_TRANSPORTER: inhibition of DNP-SG uptake in bile canalicular membrane vesicles from SD rat
Ligand InfoPC cidPC sid
In DepthDetails ArticlePubMed