BDBM50485602 CHEMBL2075010
SMILES CCSC[C@@H](NC(C)=O)C(O)=O
InChI Key InChIKey=BSVHABSINROVJJ-ZCFIWIBFSA-N
Data  1 KI
  Tab Delimited (TSV)   2D SDfile   Computed 3D by Vconf -m prep SDfile
Find this compound or compounds like it in BindingDB:
Activity Spreadsheet -- Enzyme Inhibition Constant Data from BindingDB
Found 1 hit for monomerid = 50485602
TargetSolute carrier family 22 member 6(Rattus norvegicus)
University Of Rochester School Of Medicine And Dentistry
Curated by ChEMBL
LigandPNGBDBM50485602(CHEMBL2075010)
Affinity DataKi:  1.10E+3nM. Assay description: TP_TRANSPORTER: inhibition of PAH uptake in Xenopus laevis oocytes
Ligand InfoKEGGPC cidPC sid
In DepthDetails ArticlePubMed