BDBM50485817 CHEMBL2164929
SMILES CC(C)[C@H](NC(=O)c1cc(C)on1)C(=O)N[C@@H](Cc1ccc(F)cc1)C(=O)N[C@H](CCC(N)=O)\C=C\C(=O)OCc1cn2c(C)cccc2n1
InChI Key InChIKey=TXDOHXDBDRTDGS-RDCCYBAYSA-N
Data  1 IC50
  Tab Delimited (TSV)   2D SDfile   Computed 3D by Vconf -m prep SDfile
Find this compound or compounds like it in BindingDB:
Activity Spreadsheet -- Enzyme Inhibition Constant Data from BindingDB
Found 1 hit for monomerid = 50485817
TargetGenome polyprotein(Coxsackievirus B3 (strain Nancy))
Gwangju Institute Of School Of Life Sciences
Curated by ChEMBL
LigandPNGBDBM50485817(CHEMBL2164929)
Affinity DataIC50:  160nM. Assay description: Inhibition of Coxsackievirus B3 protease 3c using NMA-EALFQGPPVK-DNP as substrate incubated for 5 mins prior to substrate addition measured after 1 h...
Ligand InfoPC cidPC sid
In DepthDetails ArticlePubMed