BDBM50486938 CHEBI:18330::Isovitexin
SMILES OC[C@H]1O[C@H]([C@H](O)[C@@H](O)[C@@H]1O)c1c(O)cc2oc(cc(=O)c2c1O)-c1ccc(O)cc1
InChI Key InChIKey=MYXNWGACZJSMBT-VJXVFPJBSA-N
Data  2 IC50
  Tab Delimited (TSV)   2D SDfile   Computed 3D by Vconf -m prep SDfile
Find this compound or compounds like it in BindingDB:
Activity Spreadsheet -- Enzyme Inhibition Constant Data from BindingDB
Found 2 hits for monomerid = 50486938
TargetSortase family protein(Staphylococcus aureus)
Indian Institute Of Technology Bombay
Curated by ChEMBL
LigandPNGBDBM50486938(CHEBI:18330 | Isovitexin)
Affinity DataIC50:  6.70E+4nM. Assay description: Inhibition of Staphylococcus aureus USA300 Sortase A protease expressed in Escherichia coli BL21 expression system using Abz-LPATG-Dap(Dnp)-NH2 as su...
In DepthDetails PubMed
TargetLysosomal alpha-glucosidase(Homo sapiens (Human))TBA
LigandPNGBDBM50486938(CHEBI:18330 | Isovitexin)
Affinity DataIC50:  1.58E+5nM. Assay description: Inhibition of alpha-glucosidase (unknown origin) using para-nitrophenyl-alpha-D-glucopyranoside as substrate incubated for 15 min prior to substrate ...
In DepthDetails Article