BDBM50487155 4-HYDROXYBUT-2-YNYL DIPHOSPHATE
SMILES OCC#CCOP(O)(=O)OP(O)(O)=O
InChI Key InChIKey=MRBQWRLYZUORCP-UHFFFAOYSA-N
Data  1 IC50
  Tab Delimited (TSV)   2D SDfile   Computed 3D by Vconf -m prep SDfile
Find this compound or compounds like it in BindingDB:
Activity Spreadsheet -- Enzyme Inhibition Constant Data from BindingDB
Found 1 hit for monomerid = 50487155
Target4-hydroxy-3-methylbut-2-enyl diphosphate reductase(Aquifex aeolicus)
University Of Illinois At Urbana-Champaign
Curated by ChEMBL
LigandPNGBDBM50487155(4-HYDROXYBUT-2-YNYL DIPHOSPHATE)
Affinity DataIC50:  2.60E+4nM. Assay description: Inhibition of Aquifex aeolicus IspH expressed in Escherichia coli BL21 (DE3) using HMBPP substrate
Ligand InfoKEGGPC cidPC sid
In DepthDetails ArticlePubMed