BDBM50487156 PROP-2-YNYL DIPHOSPHATE
SMILES OP(O)(=O)OP(O)(=O)OCC#C
InChI Key InChIKey=CEUAGVILADDFJF-UHFFFAOYSA-N
Data  1 IC50
PDB links: 2 PDB IDs match this monomer.
  Tab Delimited (TSV)   2D SDfile   Computed 3D by Vconf -m prep SDfile
Find this compound or compounds like it in BindingDB:
Activity Spreadsheet -- Enzyme Inhibition Constant Data from BindingDB
Found 1 hit for monomerid = 50487156
Target4-hydroxy-3-methylbut-2-enyl diphosphate reductase(Aquifex aeolicus)
University Of Illinois At Urbana-Champaign
Curated by ChEMBL
LigandPNGBDBM50487156(PROP-2-YNYL DIPHOSPHATE)
Affinity DataIC50:  6.70E+3nM. Assay description: Inhibition of Aquifex aeolicus IspH expressed in Escherichia coli BL21 (DE3) using HMBPP substrate
In DepthDetails ArticlePubMed