BDBM50487161 (PYRIDIN-4-YL)-METHYL-DIPHOSPHATE
SMILES OP(O)(=O)OP(O)(=O)OCc1ccncc1
InChI Key InChIKey=QYGGOAFNDFCCNJ-UHFFFAOYSA-N
Data  1 IC50
PDB links: 1 PDB ID matches this monomer.
  Tab Delimited (TSV)   2D SDfile   Computed 3D by Vconf -m prep SDfile
Find this compound or compounds like it in BindingDB:
Activity Spreadsheet -- Enzyme Inhibition Constant Data from BindingDB
Found 1 hit for monomerid = 50487161
Target4-hydroxy-3-methylbut-2-enyl diphosphate reductase(Aquifex aeolicus)
University Of Illinois At Urbana-Champaign
Curated by ChEMBL
LigandPNGBDBM50487161((PYRIDIN-4-YL)-METHYL-DIPHOSPHATE)
Affinity DataIC50:  1.49E+5nM. Assay description: Inhibition of Aquifex aeolicus IspH expressed in Escherichia coli BL21 (DE3) using HMBPP substrate
In DepthDetails ArticlePubMed