BDBM50492302 CHEMBL2398114
SMILES NC1CC=C(C1)C(=O)NOCC=C
InChI Key InChIKey=MQFVTSIJHWXIEB-UHFFFAOYSA-N
Data  1 IC50
  Tab Delimited (TSV)   2D SDfile   Computed 3D by Vconf -m prep SDfile
Find this compound or compounds like it in BindingDB:
Activity Spreadsheet -- Enzyme Inhibition Constant Data from BindingDB
Found 1 hit for monomerid = 50492302
TargetGamma-aminobutyric acid receptor subunit rho-1(Homo sapiens (Human))
University Of Sydney
Curated by ChEMBL
LigandPNGBDBM50492302(CHEMBL2398114)
Affinity DataIC50:  1.15E+5nM. Assay description: Antagonist activity at human recombinant GABAA rho1 receptor expressed in Xenopus laevis assessed as inhibition of GABA-induced chloride current prod...
Ligand InfoPC cidPC sid
In DepthDetails ArticlePubMed