BDBM50493082 CHEMBL2420945
SMILES OC1CCN(CC1)c1cccc(C(O)=O)c1C(O)=O
InChI Key InChIKey=WHCKCCDPUOWOSW-UHFFFAOYSA-N
Data  1 IC50
PDB links: 1 PDB ID matches this monomer.
  Tab Delimited (TSV)   2D SDfile   Computed 3D by Vconf -m prep SDfile
Find this compound or compounds like it in BindingDB:
Activity Spreadsheet -- Enzyme Inhibition Constant Data from BindingDB
Found 1 hit for monomerid = 50493082
TargetMetallo-beta-lactamase IMP-1(Pseudomonas aeruginosa)
Meiji Seika Pharma
Curated by ChEMBL
LigandPNGBDBM50493082(CHEMBL2420945)
Affinity DataIC50:  2.70E+3nM. Assay description: Inhibition of carbapenems-resistant Pseudomonas aeruginosa MSC15369 metallo-beta-lactamase IMP1 expressed in Escherichia coli DH5[alpha] using nitroc...
Ligand InfoPC cidPC sidPDB