BDBM50493101 CHEMBL2420949
SMILES COC1CCN(CC1)c1cccc(C(O)=O)c1C(O)=O
InChI Key InChIKey=BOLYEJZVMHQDTP-UHFFFAOYSA-N
Data  1 IC50
  Tab Delimited (TSV)   2D SDfile   Computed 3D by Vconf -m prep SDfile
Find this compound or compounds like it in BindingDB:
Activity Spreadsheet -- Enzyme Inhibition Constant Data from BindingDB
Found 1 hit for monomerid = 50493101
TargetMetallo-beta-lactamase IMP-1(Pseudomonas aeruginosa)
Meiji Seika Pharma
Curated by ChEMBL
LigandPNGBDBM50493101(CHEMBL2420949)
Affinity DataIC50:  3.70E+3nM. Assay description: Inhibition of carbapenems-resistant Pseudomonas aeruginosa MSC15369 metallo-beta-lactamase IMP1 expressed in Escherichia coli DH5[alpha] using nitroc...
Ligand InfoPC cidPC sid
In DepthDetails ArticlePubMed