BDBM50495229 CHEMBL3104104
SMILES Cc1cc(O)cc(C)c1C[C@H](N)C(=O)N1CCCc2ccccc12
InChI Key InChIKey=KRHADFQFXOESJZ-SFHVURJKSA-N
Data  3 KI
  Tab Delimited (TSV)   2D SDfile   Computed 3D by Vconf -m prep SDfile
Find this compound or compounds like it in BindingDB:
Activity Spreadsheet -- Enzyme Inhibition Constant Data from BindingDB
Found 3 hits for monomerid = 50495229
TargetMu-type opioid receptor(Homo sapiens (Human))
University Of Michigan
Curated by ChEMBL
LigandPNGBDBM50495229(CHEMBL3104104)
Affinity DataKi:  26nM. Assay description: Binding affinity to mu opioid receptor (unknown origin)
Ligand InfoPC cidPC sid
In DepthDetails ArticlePubMed
TargetDelta-type opioid receptor(Homo sapiens (Human))
University Of Michigan
Curated by ChEMBL
LigandPNGBDBM50495229(CHEMBL3104104)
Affinity DataKi:  33nM. Assay description: Binding affinity to delta opioid receptor (unknown origin)
Ligand InfoPC cidPC sid
In DepthDetails ArticlePubMed
TargetKappa-type opioid receptor(Homo sapiens (Human))
University Of Michigan
Curated by ChEMBL
LigandPNGBDBM50495229(CHEMBL3104104)
Affinity DataKi:  37nM. Assay description: Binding affinity to kappa opioid receptor (unknown origin)
Ligand InfoPC cidPC sid
In DepthDetails ArticlePubMed