BDBM50498661 CHEMBL3621865
SMILES CC(=O)N1CC(C1)n1cc(nn1)-c1cc(ccn1)C(O)=O
InChI Key InChIKey=ZWYZYIJWJJUCJE-UHFFFAOYSA-N
Data  7 IC50
  Tab Delimited (TSV)   2D SDfile   Computed 3D by Vconf -m prep SDfile
Find this compound or compounds like it in BindingDB:
Activity Spreadsheet -- Enzyme Inhibition Constant Data from BindingDB
Found 7 hits for monomerid = 50498661
TargetLysine-specific demethylase 4C(Homo sapiens (Human))
University Of Oxford
Curated by ChEMBL
LigandPNGBDBM50498661(CHEMBL3621865)
Affinity DataIC50:  1.59E+3nM. Assay description: Inhibition of KDM4C (unknown origin) using H3(1-21)K9Me3-GGK-biotin substrate incubated for 15 mins by alpha screen assay
Ligand InfoPC cidPC sid
In DepthDetails ArticlePubMed
TargetLysine-specific demethylase 2A(Homo sapiens (Human))
University Of Oxford
Curated by ChEMBL
LigandPNGBDBM50498661(CHEMBL3621865)
Affinity DataIC50: <1.00E+5nM. Assay description: Inhibition of KDM2A (unknown origin) using Biotin-H3(28-48)K36Me2 and H3(28-48)K36Me2 substrates incubated for 30 mins by alpha screen assay
Ligand InfoPC cidPC sid
In DepthDetails ArticlePubMed
TargetLysine-specific demethylase 6B(Homo sapiens (Human))
University Of Oxford
Curated by ChEMBL
LigandPNGBDBM50498661(CHEMBL3621865)
Affinity DataIC50: <1.00E+5nM. Assay description: Inhibition of KDM6B (unknown origin) using H3(21-44)K27Me3-GK-biotin substrate incubated for 5 mins by alpha screen assay
Ligand InfoPC cidPC sid
In DepthDetails ArticlePubMed
TargetLysine-specific demethylase 3A(Homo sapiens (Human))
University Of Oxford
Curated by ChEMBL
LigandPNGBDBM50498661(CHEMBL3621865)
Affinity DataIC50:  5.01E+4nM. Assay description: Inhibition of KDM3A (unknown origin) using H3(1-21)K9Me2-GGK-biotin substrate incubated for 5 mins by alpha screen assay
Ligand InfoPC cidPC sid
In DepthDetails ArticlePubMed
TargetLysine-specific demethylase 5C(Homo sapiens (Human))
University Of Oxford
Curated by ChEMBL
LigandPNGBDBM50498661(CHEMBL3621865)
Affinity DataIC50:  631nM. Assay description: Inhibition of KDM5C (unknown origin) using H3(1-21)K4Me3-GGK-biotin substrate incubated for 20 mins by alpha screen assay
Ligand InfoPC cidPC sid
In DepthDetails ArticlePubMed
TargetLysine-specific demethylase 4A(Homo sapiens (Human))
University Of Oxford
Curated by ChEMBL
LigandPNGBDBM50498661(CHEMBL3621865)
Affinity DataIC50:  2.51E+3nM. Assay description: Inhibition of KDM4A (unknown origin) using H3(1-21)K9Me3-GGK-biotin substrate by alpha screen assay
Ligand InfoPC cidPC sid
In DepthDetails ArticlePubMed
TargetLysine-specific demethylase 4E(Homo sapiens (Human))
University Of Oxford
Curated by ChEMBL
LigandPNGBDBM50498661(CHEMBL3621865)
Affinity DataIC50:  5.01E+3nM. Assay description: Inhibition of KDM4E (unknown origin) by alpha screen assay
Ligand InfoPC cidPC sid
In DepthDetails ArticlePubMed