BDBM50500920 CHEMBL3798914
SMILES C[C@@H]1CN(CCO1)c1cc(=O)c2cc(cc(CN3CCOc4c(F)cccc34)c2o1)C(=O)N(C)C
InChI Key InChIKey=NAHLQGSZCFKYIR-MRXNPFEDSA-N
Data  7 IC50
  Tab Delimited (TSV)   2D SDfile   Computed 3D by Vconf -m prep SDfile
Find this compound or compounds like it in BindingDB:
Activity Spreadsheet -- Enzyme Inhibition Constant Data from BindingDB
Found 7 hits for monomerid = 50500920
LigandPNGBDBM50500920(CHEMBL3798914)
Affinity DataIC50:  120nM. Assay description: Inhibition of human recombinant PI3Kgamma using PIP2 as substrate preincubated for 20 mins followed by substrate addition measured after 80 mins by l...
Ligand InfoPC cidPC sid
In DepthDetails ArticlePubMed
LigandPNGBDBM50500920(CHEMBL3798914)
Affinity DataIC50:  6nM. Assay description: Inhibition of human recombinant PI3Kalpha using PIP2 as substrate preincubated for 20 mins followed by substrate addition measured after 80 mins by l...
Ligand InfoPC cidPC sid
In DepthDetails ArticlePubMed
LigandPNGBDBM50500920(CHEMBL3798914)
Affinity DataIC50:  2nM. Assay description: Inhibition of PI3Kbeta in PTEN deficient human MDA-MB-468 cells assessed as inhibition of AKT phosphorylation at Ser-473 residue after 2 hrs by plate...
Ligand InfoPC cidPC sid
In DepthDetails ArticlePubMed
LigandPNGBDBM50500920(CHEMBL3798914)
Affinity DataIC50:  10nM. Assay description: Tight binding affinity to human recombinant PI3Kalpha using PIP2 as substrate preincubated for 20 mins followed by substrate addition measured after ...
Ligand InfoPC cidPC sid
In DepthDetails ArticlePubMed
LigandPNGBDBM50500920(CHEMBL3798914)
Affinity DataIC50:  10nM. Assay description: Tight binding affinity to human recombinant PI3Kbeta using PIP2 as substrate preincubated for 20 mins followed by substrate addition measured after 8...
Ligand InfoPC cidPC sid
In DepthDetails ArticlePubMed
LigandPNGBDBM50500920(CHEMBL3798914)
Affinity DataIC50:  7nM. Assay description: Inhibition of human recombinant PI3Kbeta using PIP2 as substrate preincubated for 20 mins followed by substrate addition measured after 80 mins by lu...
Ligand InfoPC cidPC sid
In DepthDetails ArticlePubMed
LigandPNGBDBM50500920(CHEMBL3798914)
Affinity DataIC50:  10nM. Assay description: Inhibition of human recombinant PI3Kdelta using PIP2 as substrate preincubated for 20 mins followed by substrate addition measured after 80 mins by l...
Ligand InfoPC cidPC sid
In DepthDetails ArticlePubMed