BDBM50501078 CHEMBL3818097
SMILES Cl.Cl.Fc1ccc(cc1)-c1cc(ccc1O[C@H]1CCNC1)C(=O)N1CCN(CC1)C(=O)c1cc(F)cc(O[C@@H]2CCNC2)c1
InChI Key InChIKey=JGXONZYGLFOACC-IBUTWNQASA-N
Data  1 KI
  Tab Delimited (TSV)   2D SDfile   Computed 3D by Vconf -m prep SDfile
Find this compound or compounds like it in BindingDB:
Activity Spreadsheet -- Enzyme Inhibition Constant Data from BindingDB
Found 1 hit for monomerid = 50501078
TargetB-cell CLL/lymphoma 9 protein(Homo sapiens)
University Of Utah
Curated by ChEMBL
LigandPNGBDBM50501078(CHEMBL3818097)
Affinity DataKi:  3.50E+4nM. Assay description: Competitive inhibition of wild type beta-catenin (unknown origin) expressed in Escherichia coli BL21 DE3 interaction with N-terminally biotinylated h...
Ligand InfoPC cidPC sid
In DepthDetails ArticlePubMed