BDBM50502488 CHEMBL4449942::US11834430, Compound 62
SMILES N#Cc1ccc(OCCOc2cccc(c2)-n2ccnc2C2CC2)cc1
InChI Key InChIKey=AZJIYOCNWUEQAE-UHFFFAOYSA-N
Data  3 IC50
  Tab Delimited (TSV)   2D SDfile   Computed 3D by Vconf -m prep SDfile
Find this compound or compounds like it in BindingDB:
Activity Spreadsheet -- Enzyme Inhibition Constant Data from BindingDB
Found 3 hits for monomerid = 50502488
TargetProtein-S-isoprenylcysteine O-methyltransferase(Homo sapiens (Human))
Usona Institute
Curated by ChEMBL
LigandPNGBDBM50502488(CHEMBL4449942 | US11834430, Compound 62)
Affinity DataIC50:  0.160nM. Assay description: Inhibition of recombinant human ICMT expressed in baculovirus infected Sf9 insect cells using SAM as substrate preincubated for 30 mins followed by s...
Ligand InfoPC cidPC sid
In DepthDetails ArticlePubMed
TargetProtein-S-isoprenylcysteine O-methyltransferase(Homo sapiens (Human))
Usona Institute
Curated by ChEMBL
LigandPNGBDBM50502488(CHEMBL4449942 | US11834430, Compound 62)
Affinity DataIC50:  8.5nM. Assay description: An ICMT enzymatic assay was developed using Promega's Methyltransferase-GloTMreagents. In the assay, ICMT catalyzes the methylation of the N-Acet...
Ligand InfoPC cidPC sid
In DepthDetails US Patent
TargetProtein-S-isoprenylcysteine O-methyltransferase(Homo sapiens (Human))
Usona Institute
Curated by ChEMBL
LigandPNGBDBM50502488(CHEMBL4449942 | US11834430, Compound 62)
Affinity DataIC50:  0.170nM. Assay description: An ICMT enzymatic assay was developed using Promega's Methyltransferase-GloTMreagents. In the assay, ICMT catalyzes the methylation of the N-Acet...
Ligand InfoPC cidPC sid
In DepthDetails US Patent