BDBM50502841 CHEMBL4447597
SMILES OC(=O)[C@H](Cc1c[nH]c2ccccc12)N[C@@H](c1cccc(Cl)c1)C(F)(F)F
InChI Key InChIKey=MVLVKGUIKWTPRD-IRXDYDNUSA-N
Data  1 KI
  Tab Delimited (TSV)   2D SDfile   Computed 3D by Vconf -m prep SDfile
Find this compound or compounds like it in BindingDB:
Activity Spreadsheet -- Enzyme Inhibition Constant Data from BindingDB
Found 1 hit for monomerid = 50502841
TargetCruzipain(Trypanosoma cruzi)
Universidade De S£O Paulo
Curated by ChEMBL
LigandPNGBDBM50502841(CHEMBL4447597)
Affinity DataKi:  141nM. Assay description: Inhibition of Trypanosoma cruzi cruzain assessed as inhibitor constant using Z-Phe-Arg-7-amido-4-methylcoumarin as substrate preincubated for 2 mins ...
Ligand InfoPC cidPC sid
In DepthDetails ArticlePubMed